{"text_format":"1","workbook":"xlsx","n_sheets":4,"sheets":["Application data","Lists","Costs & spend profile","APPLICATION DATA ERROR CHECK"],"not_rendered":{"charts":0,"images":2,"macros":1,"external_links":2,"defined_names":95,"comments":0,"pivot_tables":0},"unopened":[],"bounds":{"document_bytes":16777216,"sheet_cells":100000,"rows_first":2000,"rows_last":500,"rows_between":2000,"halvings":0,"cell_chars":16384,"cell_head_chars":4096},"cells_cut":0,"cells_raw":0,"read":"whole","date_system":"1900"}

{"sheet":"Application data","index":0,"n_rows":186,"n_cols":12,"rows_kept":186,"cut":false,"hidden":false,"merged":[[1,2,1,7],[178,1,178,4],[5,2,6,7],[151,2,151,3],[152,2,152,3],[153,2,153,3],[149,5,149,7],[146,4,146,7],[147,4,147,7],[142,4,142,7],[144,4,144,7],[145,4,145,7],[143,4,143,7],[10,5,10,7],[23,5,23,7],[12,2,12,4],[168,9,168,11],[163,1,163,7],[164,1,164,7],[154,2,154,7],[161,5,161,7],[156,2,156,3],[157,2,157,3],[158,2,158,3],[159,2,159,7],[14,2,14,4],[16,2,21,4],[23,3,23,4],[79,2,79,7],[81,2,81,7],[52,2,52,3],[52,4,52,5],[52,6,52,7],[85,2,85,7],[24,5,24,7],[50,5,50,7],[69,5,69,7],[77,5,77,7],[83,2,83,7],[53,2,53,7],[59,3,59,4],[59,6,59,7],[185,1,185,2],[185,3,185,4],[168,1,168,6],[165,1,165,7],[174,1,174,2],[174,3,174,4],[175,1,175,2],[175,3,175,4],[182,1,182,2],[182,3,182,4],[183,1,183,2],[183,3,183,4],[170,1,170,4],[88,5,88,7],[100,1,100,2],[108,1,108,3],[136,5,136,7],[121,9,121,11],[118,1,118,2],[102,1,102,3],[91,1,91,2],[92,1,92,2],[95,1,95,2],[96,1,96,2],[99,1,99,2],[105,1,105,3],[139,1,139,7],[120,5,120,7],[113,1,113,2],[114,1,114,2],[115,1,115,2],[116,1,116,2],[117,1,117,2],[138,1,138,7]]}
[]
[null,null,{"$f":"IF(Lists!L78=0,\"\",\"APPLICATION HAS ERRORS - PLEASE CORRECT BEFORE SUBMISSION\")","v":"APPLICATION HAS ERRORS - PLEASE CORRECT BEFORE SUBMISSION"}]
[]
[null,null,"Application for Newbuild Scheme Loan"]
[]
[null,null,"BEFORE COMPLETING PLEASE CLEAR THE APPLICATION BY CLICKING ON THE BUTTON BELOW"]
[]
[null,{"$f":"IF(Lists!L76>0,\"Please refer to APPLICATION DATA ERROR CHECK worksheet\",\"\")","v":"Please refer to APPLICATION DATA ERROR CHECK worksheet"}]
[null,{"$f":"IF(Lists!L77>0,\"Please refer to Costs & spend profile worksheet error check\",\"\")","v":""}]
[]
[null,"General information"]
[]
[null,"Approved Housing Body Name:",null,null,null,{"$f":"IF(C13=\"\",\"Please complete\",\"\")","v":"Please complete"}]
[]
[null,"Name of Scheme:",null,null,null,{"$f":"IF(C15=\"\",\"Please complete\",\"\")","v":"Please complete"}]
[]
[null,"Scheme Address:"]
[]
[null,null,null,null,null,{"$f":"IF(C17=\"\",\"Please complete\",\"\")","v":"Please complete"}]
[]
[]
[]
[]
[]
[null,"SECTION 1 - CONSTRUCTION COST AND TIMING"]
[]
["a","Number of housing units (input as whole number only)",null,"çInput as number"]
[]
["b","Target start on site date: dd/mm/yyyy",null,{"$f":"IF(C29=0,\"Check - please complete\",\"\")","v":"Check - please complete"}]
[]
["c","Target completion date: dd/mm/yyyy",null,{"$f":"IF(C31=0,\"Check - please complete\",\"\")","v":"Check - please complete"}]
[]
["d","Construction cost breakdown as at: dd/mm/yyyy",null,{"$f":"IF(C33=0,\"Check - please complete\",\"\")","v":"Check - please complete"}]
[]
["e","Construction period (months) - input as number only",null,"çInput as number"]
[]
["f","Land/site valuation (OMV) from independent valuer",null,{"$f":"IF(C37=0,\"Check - please complete\",\"\")","v":"Check - please complete"}]
[]
["g","Completion valuation estimate (OMV) from independent valuer",null,{"$f":"IF(C39=0,\"Check - please complete\",\"\")","v":"Check - please complete"}]
[]
{"$rows_left_out":147}
{"sheet":"Lists","index":1,"n_rows":78,"n_cols":14,"rows_kept":78,"cut":false,"hidden":true,"merged":[]}
[null,"Version: 20200325"]
[]
[null,"SinkingFund"]
[null,"Select",null,null,"Application data error checking"]
[null,"Cash"]
[null,"Reserve movement",null,null,"Approved Housing Body Name:",null,null,null,null,null,null,{"$f":"IF('Application data'!F13=\"\",0,1)","v":1}]
[null,null,null,null,"Name of Scheme:",null,null,null,null,null,null,{"$f":"IF('Application data'!F15=\"\",0,1)","v":1}]
[null,"TimePeriod",null,null,"Scheme Address:",null,null,null,null,null,null,{"$f":"IF('Application data'!F19=\"\",0,1)","v":1}]
[null,"Select",null,null,"Number of housing units (input as whole number)",null,null,null,null,null,null,{"$f":"IF('Application data'!C27=0,1,0)","v":1}]
[null,"Annual",null,null,"Target start on site date: dd/mm/yyyy",null,null,null,null,null,null,{"$f":"IF('Application data'!C29=0,1,0)","v":1}]
[null,"Five yearly",null,null,"Target completion date: dd/mm/yyyy",null,null,null,null,null,null,{"$f":"IF('Application data'!C31=0,1,0)","v":1}]
[null,null,null,null,"Construction cost breakdown as at: dd/mm/yyyy",null,null,null,null,null,null,{"$f":"IF('Application data'!C33=0,1,0)","v":1}]
[null,"YearsAdjustments",null,null,"Construction period (months) - input as number",null,null,null,null,null,null,{"$f":"IF('Application data'!C35=0,1,0)","v":1}]
[null,"Select",null,null,"Land/site valuation (OMV) from independent valuer",null,null,null,null,null,null,{"$f":"IF('Application data'!C37=0,1,0)","v":1}]
[null,3,null,null,"Completion valuation estimate (OMV) from independent valuer",null,null,null,null,null,null,{"$f":"IF('Application data'!C39=0,1,0)","v":1}]
[null,4,null,null,"Total construction cost excluding interest",null,null,null,null,null,null,{"$f":"IF('Application data'!C41=0,1,0)","v":1}]
[null,5,null,null,"Total contract retention",null,null,null,null,null,null,{"$f":"IF('Application data'!C43=0,1,0)","v":1}]
[null,null,null,null,"Total costs eligible for CALF",null,null,null,null,null,null,{"$f":"IF('Application data'!D45=\"\",0,1)","v":1}]
[null,"CALF eligible",null,null,"Retention eligible for CALF - select yes/no",null,null,null,null,null,null,{"$f":"IF('Application data'!C47=\"\",1,0)","v":1}]
[null,"Select",null,null,"CALF status",null,null,null,null,null,null,{"$f":"IF('Application data'!C53=\"\",1,0)","v":1}]
[null,"Yes",null,null,"PAA approval status",null,null,null,null,null,null,{"$f":"IF('Application data'!C54=\"\",1,0)","v":1}]
[null,"No",null,null,"CALF % of eligible construction costs - enter number",null,null,null,null,null,null,{"$f":"IF('Application data'!D56=\"\",0,1)","v":1}]
[null,null,null,null,"Approved CALF term in yrs (input as number)",null,null,null,null,null,null,{"$f":"IF('Application data'!C58=\"\",1,0)","v":1}]
[null,"Interest ",null,null,"CALF subsidy total - enter number",null,null,null,null,null,null,{"$f":"IF('Application data'!C60=\"\",1,0)","v":1}]
[null,"Select",null,null,"CALF subsidy total incorrect",null,null,null,null,null,null,{"$f":"IF(N25=FALSE,0,1)","v":0},null,{"$f":"AND('Application data'!C45>0,'Application data'!C60=0)","v":false}]
[null,"Paid",null,null,"Additional equity contribution/subsidy",null,null,null,null,null,null,{"$f":"IF('Application data'!C66=\"\",1,0)","v":1}]
[null,"Rolled-up",null,null,"The amount of construction loan requested from the HFA ",null,null,null,null,null,null,{"$f":"IF('Application data'!C72=\"\",1,0)","v":1}]
[null,null,null,null,"Amount of long-term loan at completion requested from the HFA",null,null,null,null,null,null,{"$f":"IF('Application data'!C74=\"\",1,0)","v":1}]
[null,"Facility type",null,null,"Period (years)",null,null,null,null,null,null,{"$f":"IF('Application data'!E74=\"\",1,0)","v":1}]
[null,"Select",null,null,"Interest basis",null,null,null,null,null,null,{"$f":"IF('Application data'!C76=\"\",1,0)","v":1}]
[null,"Construction loan only",null,null,"Planning status",null,null,null,null,null,null,{"$f":"IF('Application data'!C80=\"\",1,0)","v":1}]
[null,"Combined long-term facility",null,null,"Site acquisition status",null,null,null,null,null,null,{"$f":"IF('Application data'!C82=\"\",1,0)","v":1}]
[null,null,null,null,"Construction contract status",null,null,null,null,null,null,{"$f":"IF('Application data'!C84=\"\",1,0)","v":1}]
[null,"Yes/no 2",null,null,"Main contractor's name",null,null,null,null,null,null,{"$f":"IF('Application data'!C86=\"\",1,0)","v":1}]
[null,null,null,null,"Management costs",null,null,null,null,null,null,{"$f":"IF('Application data'!F92=\"ERROR - Cannot be zero\",1,0)","v":1}]
[null,"Yes",null,null,"Reactive and void maintenance costs",null,null,null,null,null,null,{"$f":"IF('Application data'!F96=\"ERROR - Cannot be zero\",1,0)","v":1}]
[null,"No",null,null,"Life Cyclical costs frequency selection",null,null,null,null,null,null,{"$f":"IF('Application data'!E103=\"\",1,0)","v":1}]
[null,"Not required",null,null,"Life cycle costs basis selection",null,null,null,null,null,null,{"$f":"IF('Application data'!E106=\"\",1,0)","v":1}]
[null,null,null,null,"Sinking fund % differential rent",null,null,null,null,null,null,{"$f":"IF(N39=TRUE,1,0)","v":0},null,{"$f":"AND('Application data'!E106=\"Sinking fund\",'Application data'!E109=0)","v":false}]
[null,"Life cycle costs",null,null,"Life cycle cost profile",null,null,null,null,null,null,{"$f":"IF(N40=FALSE,0,1)","v":0},null,{"$f":"AND('Application data'!E106=\"Profile\",SUM('Application data'!D114:E119)=0)","v":false}]
{"$rows_left_out":39}
{"sheet":"Costs & spend profile","index":2,"n_rows":79,"n_cols":36,"rows_kept":79,"cut":false,"hidden":false,"merged":[[10,3,10,6],[11,3,11,6]]}
[]
[]
[]
[]
[]
[]
[]
["Application for Newbuild Scheme Loan - detailed cost breakdown & spend profile"]
[]
[]
[null,null,"Certified Borrower",{"$f":"'Application data'!C13","v":0}]
[null,null,"Project Name",{"$f":"'Application data'!C15","v":0}]
[null,null,"Number of Units",{"$f":"'Application data'!C27","v":0}]
[null,null,"Application date",{"$f":"'Application data'!D186","v":"00:00:00"}]
[null,null,"Cost breakdown as at (date)",{"$f":"'Application data'!C33","v":"00:00:00"}]
[null,null,"Project start date",{"$f":"'Application data'!C29","v":"00:00:00"}]
[null,null,"Project end date",{"$f":"'Application data'!C31","v":"00:00:00"},{"$f":"ROUND((((D17-D16)/365)*12),0)","v":0}]
[null,null,"Number of months from start on site to completion",{"$f":"'Application data'!C35","v":0}]
[]
[null,null,"Project cost detailed breakdown - please only input whole numbers",null,null,null,null,null,null,"Project spend profile - please only input whole numbers"]
[null,null,null,null,null,null,null,null,null,"NOTE:- Please do not enter post-completion retention or other post-completion payments in the spend profile."]
[null,null,null,null,"Approved CALF",null,null,null,null,null,null,"These items should be entered in cells L59 to L62"]
[null,null,null,null,"%","Total",null,null,null,null,null,null,{"$f":"SUM(AL24:AV24)","v":0}]
[null,null,null,null,{"$f":"'Application data'!C56","v":0},{"$f":"'Application data'!C60","v":0}]
[null,null,"Cost element","Amount","Eligible","Amount","Total net of CALF",null,null,null,null,{"$f":"SUM(M25:AJ25)","v":0},{"$f":"IF(M26=\"\",0,1)","v":0},{"$f":"IF(N26=\"\",0,1)","v":0},0,0,0,0,0,0,0,0,0,0,0,0,0,0,0,0,0,0,0,0,0,0]
[null,null,null,null,null,null,null,null,null,null,null,"Project month",{"$f":"IF(M43>0,1,\"\")","v":""},{"$f":"IF(N43>0,M26+1,\"\")","v":""},"","","","","","","","","","","","","","","","","","","","","",""]
[null,null,null,null,"(select Yes/No)"]
[null,null,null,null,null,{"$f":"IF(E28=\"Yes\",ROUND((D28*$E$24),0),0)","v":0},{"$f":"D28-F28","v":0},null,null,{"$f":"IF(C28=\"\",\"\",C28)","v":""},null,{"$f":"SUM(M28:AJ28)","v":0}]
[null,null,null,null,null,{"$f":"IF(E29=\"Yes\",ROUND((D29*$E$24),0),0)","v":0},{"$f":"D29-F29","v":0},null,null,{"$f":"IF(C29=\"\",\"\",C29)","v":""},null,{"$f":"SUM(M29:AJ29)","v":0}]
[null,null,null,null,null,0,0,null,null,"",null,0]
[null,null,null,null,null,0,0,null,null,"",null,0]
[null,null,null,null,null,0,0,null,null,"",null,0]
[null,null,null,null,null,0,0,null,null,"",null,0]
[null,null,null,null,null,0,0,null,null,"",null,0]
[null,null,null,null,null,0,0,null,null,"",null,0]
[null,null,null,null,null,0,0,null,null,"",null,0]
[null,null,null,null,null,0,0,null,null,"",null,0]
[null,null,null,null,null,0,0,null,null,"",null,0]
[null,null,null,null,null,null,null,null,null,"Retention payment",null,{"$f":"SUM(M39:AJ39)","v":0}]
[]
{"$rows_left_out":40}
{"sheet":"APPLICATION DATA ERROR CHECK","index":3,"n_rows":67,"n_cols":6,"rows_kept":67,"cut":false,"hidden":false,"merged":[]}
[]
[null,null,"ERROR CHECK TOTAL"]
[null,null,{"$f":"Lists!L76","v":58}]
[]
[null,null,"Cell","Description","Check","Notes/corrective action"]
[null,null,"C13","Approved Housing Body Name",{"$f":"IF(Lists!L6=1,\"ERROR\",\"OK\")","v":"ERROR"},{"$f":"IF(E6=\"ERROR\",\"Enter AHB name\",\"\")","v":"Enter AHB name"}]
[null,null,"C15","Name of Scheme",{"$f":"IF(Lists!L7=1,\"ERROR\",\"OK\")","v":"ERROR"},{"$f":"IF(E7=\"ERROR\",\"Enter scheme/project name\",\"\")","v":"Enter scheme/project name"}]
[null,null,"C17","Scheme Address:",{"$f":"IF(Lists!L8=1,\"ERROR\",\"OK\")","v":"ERROR"},{"$f":"IF(E8=\"ERROR\",\"Enter scheme/project address\",\"\")","v":"Enter scheme/project address"}]
[null,null,"C27","Number of housing units",{"$f":"IF(Lists!L9=1,\"ERROR\",\"OK\")","v":"ERROR"},{"$f":"IF(E9=\"ERROR\",\"Enter total number of units for scheme/project as a whole number\",\"\")","v":"Enter total number of units for scheme/project as a whole number"}]
[null,null,"C29","Target start on site date",{"$f":"IF(Lists!L10=1,\"ERROR\",\"OK\")","v":"ERROR"},{"$f":"IF(E10=\"ERROR\",\"Enter start on sited date in format 01/mm/yyyy\",\"\")","v":"Enter start on sited date in format 01/mm/yyyy"}]
[null,null,"C31","Target completion date",{"$f":"IF(Lists!L11=1,\"ERROR\",\"OK\")","v":"ERROR"},{"$f":"IF(E11=\"ERROR\",\"Enter completion date in format 01/mm/yyyy\",\"\")","v":"Enter completion date in format 01/mm/yyyy"}]
[null,null,"C33","Construction cost breakdown date",{"$f":"IF(Lists!L12=1,\"ERROR\",\"OK\")","v":"ERROR"},{"$f":"IF(E12=\"ERROR\",\"Enter date of construction costs breakdown in format dd/mm/yyyy\",\"\")","v":"Enter date of construction costs breakdown in format dd/mm/yyyy"}]
[null,null,"C35","Construction period (months)",{"$f":"IF(Lists!L13=1,\"ERROR\",\"OK\")","v":"ERROR"},{"$f":"IF(E13=\"ERROR\",\"Enter construction period as a whole number of months\",\"\")","v":"Enter construction period as a whole number of months"}]
[null,null,"C37","Land/site valuation (OMV) from independent valuer",{"$f":"IF(Lists!L14=1,\"ERROR\",\"OK\")","v":"ERROR"},{"$f":"IF(E14=\"ERROR\",\"Enter your valuer's site/land valuation as a whole number\",\"\")","v":"Enter your valuer's site/land valuation as a whole number"}]
[null,null,"C39","Completion valuation (OMV) from independent valuer",{"$f":"IF(Lists!L15=1,\"ERROR\",\"OK\")","v":"ERROR"},{"$f":"IF(E15=\"ERROR\",\"Enter your valuer's completed project valuation as a whole number\",\"\")","v":"Enter your valuer's completed project valuation as a whole number"}]
[null,null,"C41","Total construction cost excluding interest",{"$f":"IF(Lists!L16=1,\"ERROR\",\"OK\")","v":"ERROR"},{"$f":"IF(E16=\"ERROR\",\"Enter the total project/construction costs including site/land purchase as a whole number\",\"\")","v":"Enter the total project/construction costs including site/land purchase as a whole number"}]
[null,null,"C43","Total contract retention",{"$f":"IF(Lists!L17=1,\"ERROR\",\"OK\")","v":"ERROR"},{"$f":"IF(E17=\"ERROR\",\"Enter the total contract retention as a whole number\",\"\")","v":"Enter the total contract retention as a whole number"}]
[null,null,"C45","Total costs eligible for CALF",{"$f":"IF(Lists!L18=1,\"ERROR\",\"OK\")","v":"ERROR"},{"$f":"IF(E18=\"ERROR\",\"Enter the total construction cost approved as eligible for CALF as a whole number even if zero\",\"\")","v":"Enter the total construction cost approved as eligible for CALF as a whole number even if zero"}]
[null,null,"C47","Retention eligible for CALF - select yes/no",{"$f":"IF(Lists!L19=1,\"ERROR\",\"OK\")","v":"ERROR"},{"$f":"IF(E19=\"ERROR\",\"Select 'Yes' or 'No' from the drop down in cell C47\",\"\")","v":"Select 'Yes' or 'No' from the drop down in cell C47"}]
[null,null,"C53","CALF approval status",{"$f":"IF(Lists!L20=1,\"ERROR\",\"OK\")","v":"ERROR"},{"$f":"IF(E20=\"ERROR\",\"Enter approval status (conditional, awaiting approval etc) - do not leave blank\",\"\")","v":"Enter approval status (conditional, awaiting approval etc) - do not leave blank"}]
[null,null,"C54","PAA approval status",{"$f":"IF(Lists!L21=1,\"ERROR\",\"OK\")","v":"ERROR"},{"$f":"IF(E21=\"ERROR\",\"Enter approval status (conditional, awaiting approval etc) - do not leave blank\",\"\")","v":"Enter approval status (conditional, awaiting approval etc) - do not leave blank"}]
[null,null,"C56","Approved CALF % of eligible costs",{"$f":"IF(Lists!L22=1,\"ERROR\",\"OK\")","v":"ERROR"},{"$f":"IF(E22=\"ERROR\",\"Enter CALF approved % of eligible costs as a whole number even if zero (automatically formats to %) - do not leave blank\",\"\")","v":"Enter CALF approved % of eligible costs as a whole number even if zero (automatically formats to %) - do not leave blank"}]
[null,null,"C58","Approved CALF term",{"$f":"IF(Lists!L23=1,\"ERROR\",\"OK\")","v":"ERROR"},{"$f":"IF(E23=\"ERROR\",\"Enter CALF approved term as a whole number even if zero (automatically formats to 'Years') - do not leave blank\",\"\")","v":"Enter CALF approved term as a whole number even if zero (automatically formats to 'Years') - do not leave blank"}]
[null,null,"C60","Total amount of approved CALF",{"$f":"IF(Lists!L24=1,\"ERROR\",\"OK\")","v":"ERROR"},{"$f":"IF(E24=\"ERROR\",\"Enter total approved CALF as a whole number (automatically formats to Euros) - do not leave blank\",\"\")","v":"Enter total approved CALF as a whole number (automatically formats to Euros) - do not leave blank"}]
[null,null,"C60","Incorrect CALF amount",{"$f":"IF(Lists!L25=1,\"ERROR\",\"OK\")","v":"OK"},{"$f":"IF(E25=\"ERROR\",\"Amount entered as total CALF is incorrect - check and correct (whole number only)\",\"\")","v":""}]
[null,null,"C66","Additional equity or capital contribution",{"$f":"IF(Lists!L26=1,\"ERROR\",\"OK\")","v":"ERROR"},{"$f":"IF(E26=\"ERROR\",\"Please enter an amount even if nil (whole number only)\",\"\")","v":"Please enter an amount even if nil (whole number only)"}]
[null,null,"C72","Amount of construction loan requested from the HFA",{"$f":"IF(Lists!L27=1,\"ERROR\",\"OK\")","v":"ERROR"},{"$f":"IF(E27=\"ERROR\",\"Enter the total construction loan requested from the HFA as a whole number\",\"\")","v":"Enter the total construction loan requested from the HFA as a whole number"}]
[null,null,"C74","Amount of long-term loan at completion requested from the HFA",{"$f":"IF(Lists!L28=1,\"ERROR\",\"OK\")","v":"ERROR"},{"$f":"IF(E28=\"ERROR\",\"Enter the total long-term loan at completion requested from the HFA as a whole number\",\"\")","v":"Enter the total long-term loan at completion requested from the HFA as a whole number"}]
[null,null,"E74","Long-term loan period in years",{"$f":"IF(Lists!L29=1,\"ERROR\",\"OK\")","v":"ERROR"},{"$f":"IF(E29=\"ERROR\",\"Enter the long-term loan period requested from the HFA as a whole number (automatically formats to 'Years')\",\"\")","v":"Enter the long-term loan period requested from the HFA as a whole number (automatically formats to 'Years')"}]
[null,null,"C76","Interest basis",{"$f":"IF(Lists!L30=1,\"ERROR\",\"OK\")","v":"ERROR"},{"$f":"IF(E30=\"ERROR\",\"Please select the interest basis from the drop down in Cell C76 - do not leave blank\",\"\")","v":"Please select the interest basis from the drop down in Cell C76 - do not leave blank"}]
[null,null,"C80","Planning status",{"$f":"IF(Lists!L31=1,\"ERROR\",\"OK\")","v":"ERROR"},{"$f":"IF(E31=\"ERROR\",\"Please enter planning status - do not leave blank\",\"\")","v":"Please enter planning status - do not leave blank"}]
[null,null,"C82","Site acquisition status",{"$f":"IF(Lists!L32=1,\"ERROR\",\"OK\")","v":"ERROR"},{"$f":"IF(E32=\"ERROR\",\"Please enter site acquisition status/date of acquisition - do not leave blank\",\"\")","v":"Please enter site acquisition status/date of acquisition - do not leave blank"}]
[null,null,"C84","Construction contract status",{"$f":"IF(Lists!L33=1,\"ERROR\",\"OK\")","v":"ERROR"},{"$f":"IF(E33=\"ERROR\",\"Please enter construction contract status - do not leave blank\",\"\")","v":"Please enter construction contract status - do not leave blank"}]
[null,null,"C86","Main contractor's name",{"$f":"IF(Lists!L34=1,\"ERROR\",\"OK\")","v":"ERROR"},{"$f":"IF(E34=\"ERROR\",\"Please enter main contractor's name - do not leave blank\",\"\")","v":"Please enter main contractor's name - do not leave blank"}]
[null,null,"E92","Management costs",{"$f":"IF(Lists!L35=1,\"ERROR\",\"OK\")","v":"ERROR"},{"$f":"IF(E35=\"ERROR\",\"Please enter management cost per unit p.a. - cannot be zero or blank\",\"\")","v":"Please enter management cost per unit p.a. - cannot be zero or blank"}]
[null,null,"E96","Reactive and void maintenance costs",{"$f":"IF(Lists!L36=1,\"ERROR\",\"OK\")","v":"ERROR"},{"$f":"IF(E36=\"ERROR\",\"Please enter reactive maintenance cost per unit p.a. - cannot be zero or blank\",\"\")","v":"Please enter reactive maintenance cost per unit p.a. - cannot be zero or blank"}]
[null,null,"E103","Life Cyclical costs frequency selection",{"$f":"IF(Lists!L37=1,\"ERROR\",\"OK\")","v":"ERROR"},{"$f":"IF(E37=\"ERROR\",\"Please select cyclical maintenance costs basis from the drop down in Cell E103 - cannot be zero or blank\",\"\")","v":"Please select cyclical maintenance costs basis from the drop down in Cell E103 - cannot be zero or blank"}]
[null,null,"E106","Life cycle costs basis selection",{"$f":"IF(Lists!L38=1,\"ERROR\",\"OK\")","v":"ERROR"},{"$f":"IF(E38=\"ERROR\",\"Please select life cycle costs basis (Profile or Sinking Fund) from the drop down in Cell E106 - cannot be zero or blank\",\"\")","v":"Please select life cycle costs basis (Profile or Sinking Fund) from the drop down in Cell E106 - cannot be zero or blank"}]
[null,null,"E109","Sinking fund life cycle costs % of Differential Rent",{"$f":"IF(Lists!L39=1,\"ERROR\",\"OK\")","v":"OK"},{"$f":"IF(E39=\"ERROR\",\"You have selected 'Sinking fund' in Cell E106 - enter the % of Differential rent for the Sinking fund\",\"\")","v":""}]
[null,null,"D114-E119","Life cycle cost profile",{"$f":"IF(Lists!L40=1,\"ERROR\",\"OK\")","v":"OK"},{"$f":"IF(E40=\"ERROR\",\"You have selected 'Profile' in Cell E106 - enter the life cycle costs profile\",\"\")","v":""}]
{"$rows_left_out":27}